Reaction Details
TargetN-methyl-D-aspartate receptor
LigandBDBM50079387
Substrate/Competitorn/a
Meas. Tech.ChEMBL_141414 (CHEMBL751708)
IC50 277±n/a nM
Citation Pabel, JHöfner, GWanner, KT Synthesis and resolution of racemic eliprodil and evaluation of the enantiomers of eliprodil as NMDA receptor antagonists. Bioorg Med Chem Lett10:1377-80 (2000) N-methyl-D-aspartate receptor
Name:N-methyl-D-aspartate receptor
Synonyms:Glutamate (NMDA) receptor subunit zeta 1
Type:PROTEIN
Mol. Mass.:27123.62
Organism:Sus scrofa
Description:ChEMBL_141416
Residue:243
BDBM50079387
NameBDBM50079387
TypeSmall organic molecule
Emp. Form.C20H23ClFNO
Mol. Mass.347.854
SMILESOC(CN1CCC(Cc2ccc(F)cc2)CC1)c1ccc(Cl)cc1