Reaction Details
Target5-hydroxytryptamine receptor 7
LigandBDBM50280053
Substrate/Competitorn/a
Ki 310±n/a nM
CommentsPDSP_667
Citation Ruat, MTraiffort, ELeurs, RTardivel-Lacombe, JDiaz, JArrang, JMSchwartz, JC Molecular cloning, characterization, and localization of a high-affinity serotonin receptor (5-HT7) activating cAMP formation. Proc Natl Acad Sci U S A90:8547-51 (1993) 
 
5-hydroxytryptamine receptor 7
Name:5-hydroxytryptamine receptor 7
Type:G Protein-Coupled Receptor (GPCR)
Mol. Mass.:49852.62
Organism:Rattus norvegicus (rat)
Description:Rat cloned 5-HT7R.
Residue:448
BDBM50280053
NameBDBM50280053
Synonyms:7-Methyl-4,6,6a,7,8,9,10,10a-octahydro-indolo[4,3-fg]quinoline-9-carboxylic acid ((2R,5S,10bS)-10b-hydroxy-5-isobutyl-2-isopropyl-3,6-dioxo-octahydro-oxazolo[3,2-a]pyrrolo[2,1-c]pyrazin-2-yl)-amide DHC | DIHYDROERGOCRYPTINE
TypeSmall organic molecule
Emp. Form.C32H43N5O5
Mol. Mass.577.7143
SMILESCC(C)C[C@@H]1N2C(=O)[C@](NC(=O)C3CC4C(Cc5c[nH]c6cccc4c56)N(C)C3)(O[C@@]2(O)C2CCCN2C1=O)C(C)C