Reaction Details
TargetBifunctional dihydrofolate reductase-thymidylate synthase
LigandBDBM50090069
Substrate/Competitorn/a
Meas. Tech.ChEMBL_216586 (CHEMBL821378)
Ki 1.1±n/a nM
Citation Yuthavong, YVilaivan, TChareonsethakul, NKamchonwongpaisan, SSirawaraporn, WQuarrell, RLowe, G Development of a lead inhibitor for the A16V+S108T mutant of dihydrofolate reductase from the cycloguanil-resistant strain (T9/94) of Plasmodium falciparum. J Med Chem43:2738-44 (2000) Bifunctional dihydrofolate reductase-thymidylate synthase
Name:Bifunctional dihydrofolate reductase-thymidylate synthase
Synonyms:Dihydrofolate Reductase-Thymidylate Synthase (DHFR-TS) Mutant KICB1
Type:n/a
Mol. Mass.:71741.43
Organism:Plasmodium falciparum
Description:n/a
Residue:608
BDBM50090069
NameBDBM50090069
TypeSmall organic molecule
Emp. Form.C11H13Cl2N5
Mol. Mass.286.16
SMILESCC1(C)N=C(N)N=C(N)N1c1ccc(Cl)c(Cl)c1