Reaction Details
Target5-hydroxytryptamine receptor 1D
LigandBDBM50090515
Substrate/Competitorn/a
Meas. Tech.ChEBML_1730
Ki 3.5±n/a nM
Citation Slassi, AEdwards, LO'Brien, AMeng, CQXin, TSeto, CLee, DKMacLean, NHynd, DChen, CWang, HKamboj, RRakhit, S 5-Alkyltryptamine derivatives as highly selective and potent 5-HT1D receptor agonists. Bioorg Med Chem Lett10:1707-9 (2000) 5-hydroxytryptamine receptor 1D
Name:5-hydroxytryptamine receptor 1D
Type:G Protein-Coupled Receptor (GPCR)
Mol. Mass.:41920.63
Organism:Homo sapiens (Human)
Description:Receptor binding assays were performed using human clone stably expressed in CHO cells.
Residue:377
BDBM50090515
NameBDBM50090515
Synonyms:5-Methyl-3-((R)-1-methyl-pyrrolidin-2-ylmethyl)-1H-indole | CHEMBL300686
TypeSmall organic molecule
Emp. Form.C15H20N2
Mol. Mass.228.3327
SMILESCN1CCC[C@@H]1Cc1c[nH]c2ccc(C)cc12