Reaction Details
Target5-hydroxytryptamine receptor 1B
LigandBDBM50090517
Substrate/Competitorn/a
Meas. Tech.ChEBML_1359
Ki 10±n/a nM
Citation Slassi, AEdwards, LO'Brien, AMeng, CQXin, TSeto, CLee, DKMacLean, NHynd, DChen, CWang, HKamboj, RRakhit, S 5-Alkyltryptamine derivatives as highly selective and potent 5-HT1D receptor agonists. Bioorg Med Chem Lett10:1707-9 (2000) 5-hydroxytryptamine receptor 1B
Name:5-hydroxytryptamine receptor 1B
Type:G Protein-Coupled Receptor (GPCR)
Mol. Mass.:43579.17
Organism:Homo sapiens (Human)
Description:Receptor binding assays were performed using human clone stably expressed in CHO cells
Residue:390
BDBM50090517
NameBDBM50090517
Synonyms:5-Isopropyl-3-((R)-1-methyl-pyrrolidin-2-ylmethyl)-1H-indole | CHEMBL44054
TypeSmall organic molecule
Emp. Form.C17H24N2
Mol. Mass.256.3859
SMILESCC(C)c1ccc2[nH]cc(C[C@H]3CCCN3C)c2c1