Reaction Details
Target5-hydroxytryptamine receptor 1B
LigandBDBM50090516
Substrate/Competitorn/a
Meas. Tech.ChEBML_1359
Ki 16±n/a nM
Citation Slassi, AEdwards, LO'Brien, AMeng, CQXin, TSeto, CLee, DKMacLean, NHynd, DChen, CWang, HKamboj, RRakhit, S 5-Alkyltryptamine derivatives as highly selective and potent 5-HT1D receptor agonists. Bioorg Med Chem Lett10:1707-9 (2000) 5-hydroxytryptamine receptor 1B
Name:5-hydroxytryptamine receptor 1B
Type:G Protein-Coupled Receptor (GPCR)
Mol. Mass.:43579.17
Organism:Homo sapiens (Human)
Description:Receptor binding assays were performed using human clone stably expressed in CHO cells
Residue:390
BDBM50090516
NameBDBM50090516
Synonyms:5-tert-Butyl-3-((R)-1-methyl-pyrrolidin-2-ylmethyl)-1H-indole | CHEMBL49826
TypeSmall organic molecule
Emp. Form.C18H26N2
Mol. Mass.270.4124
SMILESCN1CCC[C@@H]1Cc1c[nH]c2ccc(cc12)C(C)(C)C