Reaction Details
Target5-hydroxytryptamine receptor 1D
LigandBDBM50090522
Substrate/Competitorn/a
Meas. Tech.ChEBML_1730
Ki 0.970000±n/a nM
Citation Slassi, AEdwards, LO'Brien, AMeng, CQXin, TSeto, CLee, DKMacLean, NHynd, DChen, CWang, HKamboj, RRakhit, S 5-Alkyltryptamine derivatives as highly selective and potent 5-HT1D receptor agonists. Bioorg Med Chem Lett10:1707-9 (2000) 5-hydroxytryptamine receptor 1D
Name:5-hydroxytryptamine receptor 1D
Type:G Protein-Coupled Receptor (GPCR)
Mol. Mass.:41920.63
Organism:Homo sapiens (Human)
Description:Receptor binding assays were performed using human clone stably expressed in CHO cells.
Residue:377
BDBM50090522
NameBDBM50090522
Synonyms:5-Ethyl-3-((R)-1-methyl-pyrrolidin-2-ylmethyl)-1H-indole | CHEMBL45929
TypeSmall organic molecule
Emp. Form.C16H22N2
Mol. Mass.242.3593
SMILESCCc1ccc2[nH]cc(C[C@H]3CCCN3C)c2c1