Reaction Details
TargetGonadotropin-releasing hormone receptor
LigandBDBM50090540
Substrate/Competitorn/a
Meas. Tech.ChEBML_71580
IC50 0.300000±n/a nM
Citation Young, JRHuang, SXChen, IWalsh, TFDeVita, RJWyvratt, MJGoulet, MTRen, NLo, JYang, YTYudkovitz, JBCheng, KSmith, RG Quinolones as gonadotropin releasing hormone (GnRH) antagonists: simultaneous optimization of the C(3)-aryl and C(6)-substituents. Bioorg Med Chem Lett10:1723-7 (2000) Gonadotropin-releasing hormone receptor
Name:Gonadotropin-releasing hormone receptor
Type:Enzyme
Mol. Mass.:37749.45
Organism:Homo sapiens (Human)
Description:P30968
Residue:328
BDBM50090540
NameBDBM50090540
Synonyms:7-Chloro-2-oxo-4-((S)-2-piperidin-2-yl-ethoxy)-3-(3,4,5-trimethyl-phenyl)-1,2-dihydro-quinoline-6-carboxylic acid pyrimidin-4-ylamide CHEMBL48192
TypeSmall organic molecule
Emp. Form.C30H32ClN5O3
Mol. Mass.546.06
SMILESCc1cc(cc(C)c1C)-c1c(OCC[C@@H]2CCCCN2)c2cc(C(=O)Nc3ccncn3)c(Cl)cc2[nH]c1=O