Reaction Details
Target5-hydroxytryptamine receptor 1A
LigandBDBM50090761
Substrate/Competitorn/a
Meas. Tech.ChEMBL_1206 (CHEMBL615972)
Ki 18.5±n/a nM
Citation Hammarberg, ENordvall, GLeideborg, RNylöf, MHanson, SJohansson, LThorberg, SOTolf, BRJerning, ESvantesson, GTMohell, NAhlgren, CWestlind-Danielsson, ACsöregh, IJohansson, R Synthesis of novel 5-substituted 3-amino-3,4-dihydro-2H-1-benzopyran derivatives and their interactions with the 5-HT1A receptor. J Med Chem43:2837-50 (2000) 5-hydroxytryptamine receptor 1A
Name:5-hydroxytryptamine receptor 1A
Type:G Protein-Coupled Receptor (GPCR)
Mol. Mass.:46445.29
Organism:Rattus norvegicus (rat)
Description:Binding assays were performed using rat hippocampal membranes.
Residue:422
BDBM50090761
NameBDBM50090761
Synonyms:(R)-3-(Cyclopentyl-propyl-amino)-chroman-5-carboxylic acid methylamide CHEMBL95858
TypeSmall organic molecule
Emp. Form.C19H28N2O2
Mol. Mass.316.4378
SMILESCCCN(C1CCCC1)C1COc2cccc(C(=O)NC)c2C1