Reaction Details
Target5-hydroxytryptamine receptor 2A
LigandBDBM50090758
Substrate/Competitorn/a
Meas. Tech.ChEMBL_2665 (CHEMBL617913)
Ki>1000±n/a nM
Citation Hammarberg, ENordvall, GLeideborg, RNylöf, MHanson, SJohansson, LThorberg, SOTolf, BRJerning, ESvantesson, GTMohell, NAhlgren, CWestlind-Danielsson, ACsöregh, IJohansson, R Synthesis of novel 5-substituted 3-amino-3,4-dihydro-2H-1-benzopyran derivatives and their interactions with the 5-HT1A receptor. J Med Chem43:2837-50 (2000) 5-hydroxytryptamine receptor 2A
Name:5-hydroxytryptamine receptor 2A
Type:G Protein-Coupled Receptor (GPCR)
Mol. Mass.:52852.05
Organism:Rattus norvegicus (rat)
Description:Rat cortex membranes 5-HT2A receptors.
Residue:471
BDBM50090758
NameBDBM50090758
Synonyms:(R)-3-(Cyclopentyl-propyl-amino)-chroman-5-carboxylic acid amide | CHEMBL97251
TypeSmall organic molecule
Emp. Form.C18H26N2O2
Mol. Mass.302.4112
SMILESCCCN(C1CCCC1)C1COc2cccc(C(N)=O)c2C1