Reaction Details
TargetD(2) dopamine receptor
LigandBDBM50090759
Substrate/Competitorn/a
Meas. Tech.ChEMBL_61455 (CHEMBL670882)
Ki>1000±n/a nM
Citation Hammarberg, ENordvall, GLeideborg, RNylöf, MHanson, SJohansson, LThorberg, SOTolf, BRJerning, ESvantesson, GTMohell, NAhlgren, CWestlind-Danielsson, ACsöregh, IJohansson, R Synthesis of novel 5-substituted 3-amino-3,4-dihydro-2H-1-benzopyran derivatives and their interactions with the 5-HT1A receptor. J Med Chem43:2837-50 (2000) D(2) dopamine receptor
Name:D(2) dopamine receptor
Type:Cell-surface receptors
Mol. Mass.:50647.10
Organism:Homo sapiens (Human)
Description:P14416
Residue:443
BDBM50090759
NameBDBM50090759
Synonyms:(R)-3-Dipropylamino-chroman-5-carboxylic acid isopropylamide CHEMBL95688
TypeSmall organic molecule
Emp. Form.C19H30N2O2
Mol. Mass.318.4537
SMILESCCCN(CCC)C1COc2cccc(C(=O)NC(C)C)c2C1