Reaction Details
TargetProstaglandin G/H synthase 2
LigandBDBM50090792
Substrate/Competitorn/a
Meas. Tech.ChEMBL_43839 (CHEMBL658501)
IC50 40±n/a nM
Citation Kalgutkar, ASMarnett, ABCrews, BCRemmel, RPMarnett, LJ Ester and amide derivatives of the nonsteroidal antiinflammatory drug, indomethacin, as selective cyclooxygenase-2 inhibitors. J Med Chem43:2860-70 (2000) Prostaglandin G/H synthase 2
Name:Prostaglandin G/H synthase 2
Type:Enzyme
Mol. Mass.:69003.89
Organism:Homo sapiens (Human)
Description:Recombinant Cox-2 provided by Cayman (Cayman Chemical Co.,Ann Arbor, MI).
Residue:604
BDBM50090792
NameBDBM50090792
Synonyms:2-(1-(4-chlorobenzoyl)-5-methoxy-2-methyl-1H-indol-3-yl)-N-octylacetamide CHEMBL100331
TypeSmall organic molecule
Emp. Form.C27H33ClN2O3
Mol. Mass.469.016
SMILESCCCCCCCCNC(=O)Cc1c(C)n(C(=O)c2ccc(Cl)cc2)c2ccc(OC)cc12