Reaction Details
TargetTyrosine-protein kinase SYK
LigandBDBM50535089
Substrate/Competitorn/a
Meas. Tech.ChEMBL_1929867 (CHEMBL4433043)
IC50 16±n/a nM
Citation Garton, NSBarker, MDDavis, RPDouault, CHooper-Greenhill, EJones, ELewis, HDLiddle, JLugo, DMcCleary, SPreston, AGSRamirez-Molina, CNeu, MShipley, TJSomers, DOWatson, RJWilson, DM Optimisation of a novel series of potent and orally bioavailable azanaphthyridine SYK inhibitors. Bioorg Med Chem Lett26:4606-4612 (2016) 
 
Tyrosine-protein kinase SYK
Name:Tyrosine-protein kinase SYK
Type:Enzyme
Mol. Mass.:72079.99
Organism:Homo sapiens (Human)
Description:P43405
Residue:635
BDBM50535089
NameBDBM50535089
Synonyms:CHEMBL4528289
TypeSmall organic molecule
Emp. Form.C20H25N7
Mol. Mass.363.4594
SMILESCN(C)c1ccc(cn1)-c1cc2nccnc2c(NC[C@H]2CCCNC2)n1