Reaction Details
TargetTyrosine-protein kinase SYK
LigandBDBM50535107
Substrate/Competitorn/a
Meas. Tech.ChEMBL_1929867 (CHEMBL4433043)
IC50 7.9±n/a nM
Citation Garton, NSBarker, MDDavis, RPDouault, CHooper-Greenhill, EJones, ELewis, HDLiddle, JLugo, DMcCleary, SPreston, AGSRamirez-Molina, CNeu, MShipley, TJSomers, DOWatson, RJWilson, DM Optimisation of a novel series of potent and orally bioavailable azanaphthyridine SYK inhibitors. Bioorg Med Chem Lett26:4606-4612 (2016) 
 
Tyrosine-protein kinase SYK
Name:Tyrosine-protein kinase SYK
Type:Enzyme
Mol. Mass.:72079.99
Organism:Homo sapiens (Human)
Description:P43405
Residue:635
BDBM50535107
NameBDBM50535107
Synonyms:CHEMBL4468047
TypeSmall organic molecule
Emp. Form.C21H26N6
Mol. Mass.362.4713
SMILESCN(C)c1ccc(cn1)-c1cc2ncccc2c(NC[C@H]2CCCNC2)n1