Reaction Details
TargetTyrosine-protein kinase SYK
LigandBDBM50535083
Substrate/Competitorn/a
Meas. Tech.ChEMBL_1929867 (CHEMBL4433043)
IC50 2.5±n/a nM
Citation Garton, NSBarker, MDDavis, RPDouault, CHooper-Greenhill, EJones, ELewis, HDLiddle, JLugo, DMcCleary, SPreston, AGSRamirez-Molina, CNeu, MShipley, TJSomers, DOWatson, RJWilson, DM Optimisation of a novel series of potent and orally bioavailable azanaphthyridine SYK inhibitors. Bioorg Med Chem Lett26:4606-4612 (2016) 
 
Tyrosine-protein kinase SYK
Name:Tyrosine-protein kinase SYK
Type:Enzyme
Mol. Mass.:72079.99
Organism:Homo sapiens (Human)
Description:P43405
Residue:635
BDBM50535083
NameBDBM50535083
Synonyms:CHEMBL4460676
TypeSmall organic molecule
Emp. Form.C20H23F2N7
Mol. Mass.399.4403
SMILESCN(C)c1ccc(cn1)-c1cc2nccnc2c(NC[C@@H]2CNCCC2(F)F)n1