Reaction Details
TargetEndothelin-1 receptor
LigandBDBM50091105
Substrate/Competitorn/a
Meas. Tech.ChEMBL_65638 (CHEMBL681520)
Ki 1.4±n/a nM
Citation Murugesan, NGu, ZStein, PDSpergel, SMathur, ALeith, LLiu, ECZhang, RBird, EWaldron, TMarino, AMorrison, RAWebb, MLMoreland, SBarrish, JC Biphenylsulfonamide endothelin receptor antagonists. 2. Discovery of 4'-oxazolyl biphenylsulfonamides as a new class of potent, highly selective ET(A) antagonists. J Med Chem43:3111-7 (2000) Endothelin-1 receptor
Name:Endothelin-1 receptor
Type:Enzyme Catalytic Domain
Mol. Mass.:48736.88
Organism:Homo sapiens (Human)
Description:P25101
Residue:427
BDBM50091105
NameBDBM50091105
Synonyms:4''-Oxazol-2-yl-biphenyl-2-sulfonic acid (3,4-dimethyl-isoxazol-5-yl)-amide 4'-Oxazol-2-yl-biphenyl-2-sulfonicacid(3,4-dimethyl-isoxazol-5-yl)-amide CHEMBL24461
TypeSmall organic molecule
Emp. Form.C20H17N3O4S
Mol. Mass.395.432
SMILESCc1noc(NS(=O)(=O)c2ccccc2-c2ccc(cc2)-c2ncco2)c1C