Reaction Details
TargetProtein kinase C alpha type
LigandBDBM50091261
Substrate/Competitorn/a
Meas. Tech.ChEMBL_160292 (CHEMBL769620)
Ki 327±n/a nM
Citation Tamamura, HBienfait, BNacro, KLewin, NEBlumberg, PMMarquez, VE Conformationally constrained analogues of diacylglycerol (DAG). 17. Contrast between sn-1 and sn-2 DAG lactones in binding to protein kinase C. J Med Chem43:3209-17 (2000) Protein kinase C alpha type
Name:Protein kinase C alpha type
Type:Enzyme
Mol. Mass.:76755.65
Organism:Homo sapiens (Human)
Description:The recombinant human PKC enzymes were produced using a baculovirus expression system in SF9 cells
Residue:672
BDBM50091261
NameBDBM50091261
Synonyms:3-Isopropyl-4-methyl-pentanoic acid 2-hydroxy-1-[4-(3-isopropyl-4-methyl-pentylidene)-5-oxo-tetrahydro-furan-2-yl]-ethyl ester | CHEMBL107602
TypeSmall organic molecule
Emp. Form.C24H42O5
Mol. Mass.410.5873
SMILESCC(C)C(C\C=C1\CC(OC1=O)[C@H](CO)OC(=O)CC(C(C)C)C(C)C)C(C)C