Reaction Details
TargetVitamin K epoxide reductase complex subunit 1
LigandBDBM50343352
Substrate/Competitorn/a
Meas. Tech.ChEMBL_1930830 (CHEMBL4434081)
IC50 8.8±n/a nM
Citation Xing, HHouston, SDChen, XJin, DYSavage, GPTie, JKWilliams, CM Determining the necessity of phenyl ring ?-character in warfarin. Bioorg Med Chem Lett29:1954-1956 (2019) 
 
Vitamin K epoxide reductase complex subunit 1
Name:Vitamin K epoxide reductase complex subunit 1
Type:Enzyme
Mol. Mass.:18244.90
Organism:Homo sapiens (Human)
Description:Q9BQB6
Residue:163
BDBM50343352
NameBDBM50343352
Synonyms:2-hydroxy-3-(3-oxo-1-phenylbutyl)-4H-chromen-4-one 4-Hydroxy-3-(3-oxo-1-phenyl-butyl)-chromen-2-one CHEMBL1464 Jantoven wafarin warfarine
TypeSmall organic molecule
Emp. Form.C19H16O4
Mol. Mass.308.3279
SMILESCC(=O)CC(c1ccccc1)c1c(O)c2ccccc2oc1=O