Reaction Details
TargetMisshapen-like kinase 1
LigandBDBM50535491
Substrate/Competitorn/a
Meas. Tech.ChEMBL_1930834 (CHEMBL4434085)
IC50 126±n/a nM
Citation Read, JCollie, ITNguyen-McCarty, MLucaj, CRobinson, JConway, LMukherjee, JMcCall, EDonohoe, GFlavell, EPeciak, KWarwicker, JDix, CVan den Hoven, BGMadin, ABrown, DGMoss, SHaggarty, SJBrandon, NJBürli, RW Tool inhibitors and assays to interrogate the biology of the TRAF2 and NCK interacting kinase. Bioorg Med Chem Lett29:1962-1967 (2019) 
 
Misshapen-like kinase 1
Name:Misshapen-like kinase 1
Type:PROTEIN
Mol. Mass.:149838.92
Organism:Homo sapiens (Human)
Description:ChEMBL_793919
Residue:1332
BDBM50535491
NameBDBM50535491
Synonyms:CHEMBL4558962
TypeSmall organic molecule
Emp. Form.C22H20N4O
Mol. Mass.356.4204
SMILESCC(C)NC(=O)c1ccc(cc1)-c1cnc(N)c(c1)-c1ccc(cc1)C#N