Reaction Details
TargetMisshapen-like kinase 1
LigandBDBM50535493
Substrate/Competitorn/a
Meas. Tech.ChEMBL_1930839 (CHEMBL4434090)
IC50 63096±n/a nM
Citation Read, JCollie, ITNguyen-McCarty, MLucaj, CRobinson, JConway, LMukherjee, JMcCall, EDonohoe, GFlavell, EPeciak, KWarwicker, JDix, CVan den Hoven, BGMadin, ABrown, DGMoss, SHaggarty, SJBrandon, NJBürli, RW Tool inhibitors and assays to interrogate the biology of the TRAF2 and NCK interacting kinase. Bioorg Med Chem Lett29:1962-1967 (2019) 
 
Misshapen-like kinase 1
Name:Misshapen-like kinase 1
Type:PROTEIN
Mol. Mass.:149838.92
Organism:Homo sapiens (Human)
Description:ChEMBL_793919
Residue:1332
BDBM50535493
NameBDBM50535493
Synonyms:CHEMBL4465524
TypeSmall organic molecule
Emp. Form.C24H24N4O
Mol. Mass.384.4736
SMILESCC(C)NC(=O)c1ccc(cc1)-c1cnc(N(C)C)c(c1)-c1ccc(cc1)C#N