Reaction Details
TargetMisshapen-like kinase 1
LigandBDBM50535490
Substrate/Competitorn/a
Meas. Tech.ChEMBL_1930839 (CHEMBL4434090)
IC50 6310±n/a nM
Citation Read, JCollie, ITNguyen-McCarty, MLucaj, CRobinson, JConway, LMukherjee, JMcCall, EDonohoe, GFlavell, EPeciak, KWarwicker, JDix, CVan den Hoven, BGMadin, ABrown, DGMoss, SHaggarty, SJBrandon, NJBürli, RW Tool inhibitors and assays to interrogate the biology of the TRAF2 and NCK interacting kinase. Bioorg Med Chem Lett29:1962-1967 (2019) 
 
Misshapen-like kinase 1
Name:Misshapen-like kinase 1
Type:PROTEIN
Mol. Mass.:149838.92
Organism:Homo sapiens (Human)
Description:ChEMBL_793919
Residue:1332
BDBM50535490
NameBDBM50535490
Synonyms:CHEMBL4451091
TypeSmall organic molecule
Emp. Form.C20H20N2O3S
Mol. Mass.368.449
SMILESCN(C)c1ncc(cc1-c1ccc(cc1)S(C)(=O)=O)-c1ccc(O)cc1