Reaction Details
TargetMisshapen-like kinase 1
LigandBDBM50535492
Substrate/Competitorn/a
Meas. Tech.ChEMBL_1930834 (CHEMBL4434085)
IC50 25119±n/a nM
Citation Read, JCollie, ITNguyen-McCarty, MLucaj, CRobinson, JConway, LMukherjee, JMcCall, EDonohoe, GFlavell, EPeciak, KWarwicker, JDix, CVan den Hoven, BGMadin, ABrown, DGMoss, SHaggarty, SJBrandon, NJBürli, RW Tool inhibitors and assays to interrogate the biology of the TRAF2 and NCK interacting kinase. Bioorg Med Chem Lett29:1962-1967 (2019) 
 
Misshapen-like kinase 1
Name:Misshapen-like kinase 1
Type:PROTEIN
Mol. Mass.:149838.92
Organism:Homo sapiens (Human)
Description:ChEMBL_793919
Residue:1332
BDBM50535492
NameBDBM50535492
Synonyms:CHEMBL4558988
TypeSmall organic molecule
Emp. Form.C13H8FN3
Mol. Mass.225.2211
SMILESFc1cc(ccn1)-c1ccc2ccncc2n1