Reaction Details
TargetMisshapen-like kinase 1
LigandBDBM50138153
Substrate/Competitorn/a
Meas. Tech.ChEMBL_1930839 (CHEMBL4434090)
IC50 16±n/a nM
Citation Read, JCollie, ITNguyen-McCarty, MLucaj, CRobinson, JConway, LMukherjee, JMcCall, EDonohoe, GFlavell, EPeciak, KWarwicker, JDix, CVan den Hoven, BGMadin, ABrown, DGMoss, SHaggarty, SJBrandon, NJBürli, RW Tool inhibitors and assays to interrogate the biology of the TRAF2 and NCK interacting kinase. Bioorg Med Chem Lett29:1962-1967 (2019) 
 
Misshapen-like kinase 1
Name:Misshapen-like kinase 1
Type:PROTEIN
Mol. Mass.:149838.92
Organism:Homo sapiens (Human)
Description:ChEMBL_793919
Residue:1332
BDBM50138153
NameBDBM50138153
Synonyms:CHEMBL3754283
TypeSmall organic molecule
Emp. Form.C18H16N2O3S
Mol. Mass.340.396
SMILESCS(=O)(=O)c1ccc(cc1)-c1cc(cnc1N)-c1ccc(O)cc1