Reaction Details
TargetMisshapen-like kinase 1
LigandBDBM299256
Substrate/Competitorn/a
Meas. Tech.ChEMBL_1930834 (CHEMBL4434085)
IC50 200±n/a nM
Citation Read, JCollie, ITNguyen-McCarty, MLucaj, CRobinson, JConway, LMukherjee, JMcCall, EDonohoe, GFlavell, EPeciak, KWarwicker, JDix, CVan den Hoven, BGMadin, ABrown, DGMoss, SHaggarty, SJBrandon, NJBürli, RW Tool inhibitors and assays to interrogate the biology of the TRAF2 and NCK interacting kinase. Bioorg Med Chem Lett29:1962-1967 (2019) 
 
Misshapen-like kinase 1
Name:Misshapen-like kinase 1
Type:PROTEIN
Mol. Mass.:149838.92
Organism:Homo sapiens (Human)
Description:ChEMBL_793919
Residue:1332
BDBM299256
NameBDBM299256
Synonyms:6-(2-fluoro-4-pyridyl)pyrido[3,2-d]pyrimidin-4-amine US9855269, Compound 154
TypeSmall organic molecule
Emp. Form.C12H8FN5
Mol. Mass.241.2238
SMILESNc1ncnc2ccc(nc12)-c1ccnc(F)c1