Reaction Details
TargetNitric oxide synthase, inducible
LigandBDBM14320
Substrate/Competitorn/a
Meas. Tech.ChEBML_89191
IC50 4600±n/a nM
Citation Hagmann, WKCaldwell, CGChen, PDurette, PLEsser, CKLanza, TJKopka, IEGuthikonda, RShah, SKMacCoss, MChabin, RMFletcher, DGrant, SKGreen, BGHumes, JLKelly, TMLuell, SMeurer, RMoore, VPacholok, SGPavia, TWilliams, HRWong, KK Substituted 2-aminopyridines as inhibitors of nitric oxide synthases. Bioorg Med Chem Lett10:1975-8 (2001) Nitric oxide synthase, inducible
Name:Nitric oxide synthase, inducible
Type:Homodimer
Mol. Mass.:131141.95
Organism:Homo sapiens (Human)
Description:P35228
Residue:1153
BDBM14320
NameBDBM14320
Synonyms:1-amino-isoquinoline Fragment 17 isoquinolin-1-amine
TypeSmall organic molecule
Emp. Form.C9H8N2
Mol. Mass.144.1732
SMILESNc1nccc2ccccc12