Reaction Details
TargetMitogen-activated protein kinase 14
LigandBDBM13336
Substrate/Competitorn/a
Meas. Tech.ChEBML_124643
IC50 20±n/a nM
Citation Dumas, JHatoum-Mokdad, HSibley, RRiedl, BScott, WJMonahan, MKLowinger, TBBrennan, CNatero, RTurner, TJohnson, JSSchoenleber, RBhargava, AWilhelm, SMHousley, TJRanges, GEShrikhande, A 1-Phenyl-5-pyrazolyl ureas: potent and selective p38 kinase inhibitors. Bioorg Med Chem Lett10:2051-4 (2000) Mitogen-activated protein kinase 14
Name:Mitogen-activated protein kinase 14
Type:Serine/threonine-protein kinase
Mol. Mass.:41286.76
Organism:Homo sapiens (Human)
Description:Q16539
Residue:360
BDBM13336
NameBDBM13336
Synonyms:4-[4-(4-fluorophenyl)-2-(4-methanesulfinylphenyl)-1H-imidazol-5-yl]pyridine 4-{4-(4-fluorophenyl)-2-[4-(methylsulfinyl)phenyl]-1H-imidazol-5-yl}pyridine SB-203580 cid_176155
TypeSmall organic molecule
Emp. Form.C21H16FN3OS
Mol. Mass.377.435
SMILESCS(=O)c1ccc(cc1)-c1nc(c([nH]1)-c1ccc(F)cc1)-c1ccncc1