Reaction Details
TargetInsulin receptor
LigandBDBM50092149
Substrate/Competitorn/a
Meas. Tech.ChEMBL_88875 (CHEMBL698212)
EC50 5000±n/a nM
Citation Liu, KXu, LSzalkowski, DLi, ZDing, VKwei, GHuskey, SMoller, DEHeck, JVZhang, BBJones, AB Discovery of a potent, highly selective, and orally efficacious small-molecule activator of the insulin receptor. J Med Chem43:3487-94 (2000) Insulin receptor
Name:Insulin receptor
Type:Receptor Tyrosine Kinase
Mol. Mass.:156322.60
Organism:Homo sapiens (Human)
Description:P06213
Residue:1382
BDBM50092149
NameBDBM50092149
Synonyms:2-[2-(1,1-Dimethyl-allyl)-1H-indol-3-yl]-3,6-dihydroxy-5-[7-(3-methyl-but-2-enyl)-1H-indol-3-yl]-[1,4]benzoquinone | CHEMBL18879
TypeSmall organic molecule
Emp. Form.C32H30N2O4
Mol. Mass.506.5916
SMILESCC(C)=CCc1cccc2c(c[nH]c12)C1C(=O)C(=O)C(c2c([nH]c3ccccc23)C(C)(C)C=C)C(=O)C1=O