Reaction Details
TargetTyrosine-protein kinase Lck
LigandBDBM50092233
Substrate/Competitorn/a
Meas. Tech.ChEMBL_221324 (CHEMBL842016)
IC50 10±n/a nM
Citation Burchat, AFCalderwood, DJHirst, GCHolman, NJJohnston, DNMunschauer, RRafferty, PTometzki, GB Pyrrolo[2,3-d]pyrimidines containing an extended 5-substituent as potent and selective inhibitors of lck II. Bioorg Med Chem Lett10:2171-4 (2001) Tyrosine-protein kinase Lck
Name:Tyrosine-protein kinase Lck
Type:n/a
Mol. Mass.:57987.83
Organism:Homo sapiens (Human)
Description:P06239
Residue:509
BDBM50092233
NameBDBM50092233
Synonyms:7-Isopropyl-5-(4-phenoxy-phenyl)-7H-pyrrolo[2,3-d]pyrimidin-4-ylamine | CHEMBL307982
TypeSmall organic molecule
Emp. Form.C21H20N4O
Mol. Mass.344.4097
SMILESCC(C)n1cc(-c2ccc(Oc3ccccc3)cc2)c2c(N)ncnc12