Reaction Details
TargetTyrosine-protein kinase Lck
LigandBDBM50092228
Substrate/Competitorn/a
Meas. Tech.ChEMBL_221324 (CHEMBL842016)
IC50<1±n/a nM
Citation Burchat, AFCalderwood, DJHirst, GCHolman, NJJohnston, DNMunschauer, RRafferty, PTometzki, GB Pyrrolo[2,3-d]pyrimidines containing an extended 5-substituent as potent and selective inhibitors of lck II. Bioorg Med Chem Lett10:2171-4 (2001) Tyrosine-protein kinase Lck
Name:Tyrosine-protein kinase Lck
Type:n/a
Mol. Mass.:57987.83
Organism:Homo sapiens (Human)
Description:P06239
Residue:509
BDBM50092228
NameBDBM50092228
Synonyms:4-Amino-5-(4-phenoxyphenyl)-7H-pyrrolo[2,3-d]pyrimidin-7-yl-cyclopentane CHEMBL47940 | NCGC00015280
TypeSmall organic molecule
Emp. Form.C23H22N4O
Mol. Mass.370.447
SMILESNc1ncnc2n(cc(-c3ccc(Oc4ccccc4)cc3)c12)C1CCCC1