Reaction Details
TargetTyrosine-protein kinase Lck
LigandBDBM50092240
Substrate/Competitorn/a
Meas. Tech.ChEMBL_221324 (CHEMBL842016)
IC50<3±n/a nM
Citation Burchat, AFCalderwood, DJHirst, GCHolman, NJJohnston, DNMunschauer, RRafferty, PTometzki, GB Pyrrolo[2,3-d]pyrimidines containing an extended 5-substituent as potent and selective inhibitors of lck II. Bioorg Med Chem Lett10:2171-4 (2001) Tyrosine-protein kinase Lck
Name:Tyrosine-protein kinase Lck
Type:n/a
Mol. Mass.:57987.83
Organism:Homo sapiens (Human)
Description:P06239
Residue:509
BDBM50092240
NameBDBM50092240
Synonyms:5-[4-(3-Amino-phenoxy)-phenyl]-7-tert-butyl-7H-pyrrolo[2,3-d]pyrimidin-4-ylamine | CHEMBL433097
TypeSmall organic molecule
Emp. Form.C22H23N5O
Mol. Mass.373.4509
SMILESCC(C)(C)n1cc(-c2ccc(Oc3cccc(N)c3)cc2)c2c(N)ncnc12