Reaction Details
TargetMisshapen-like kinase 1
LigandBDBM50536681
Substrate/Competitorn/a
Meas. Tech.ChEMBL_1934100 (CHEMBL4479752)
IC50 140±n/a nM
Citation Sloman, DLNoucti, NAltman, MDChen, DMislak, ACSzewczak, AHayashi, MWarren, LDellovade, TWu, ZMarcus, JWalker, DSu, HPEdavettal, SCMunshi, SHutton, MNuthall, HStanton, MG Optimization of microtubule affinity regulating kinase (MARK) inhibitors with improved physical properties. Bioorg Med Chem Lett26:4362-6 (2016) 
 
Misshapen-like kinase 1
Name:Misshapen-like kinase 1
Type:PROTEIN
Mol. Mass.:149838.92
Organism:Homo sapiens (Human)
Description:ChEMBL_793919
Residue:1332
BDBM50536681
NameBDBM50536681
Synonyms:CHEMBL4552628
TypeSmall organic molecule
Emp. Form.C18H18ClF2N5OS
Mol. Mass.425.883
SMILESCc1sc(cc1-c1cnn2cc(Cl)cnc12)C(=O)N[C@@H]1[C@H](N)CCCC1(F)F