Reaction Details
TargetMisshapen-like kinase 1
LigandBDBM50536675
Substrate/Competitorn/a
Meas. Tech.ChEMBL_1934100 (CHEMBL4479752)
IC50 13±n/a nM
Citation Sloman, DLNoucti, NAltman, MDChen, DMislak, ACSzewczak, AHayashi, MWarren, LDellovade, TWu, ZMarcus, JWalker, DSu, HPEdavettal, SCMunshi, SHutton, MNuthall, HStanton, MG Optimization of microtubule affinity regulating kinase (MARK) inhibitors with improved physical properties. Bioorg Med Chem Lett26:4362-6 (2016) 
 
Misshapen-like kinase 1
Name:Misshapen-like kinase 1
Type:PROTEIN
Mol. Mass.:149838.92
Organism:Homo sapiens (Human)
Description:ChEMBL_793919
Residue:1332
BDBM50536675
NameBDBM50536675
Synonyms:CHEMBL4569508
TypeSmall organic molecule
Emp. Form.C26H26F3N5O2S
Mol. Mass.529.577
SMILESFC(F)(F)CNC(=O)c1cc(cs1)-c1cnn2cc(cnc12)-c1ccc(OCCN2CCCCC2)cc1