Reaction Details
TargetMisshapen-like kinase 1
LigandBDBM50536678
Substrate/Competitorn/a
Meas. Tech.ChEMBL_1934100 (CHEMBL4479752)
IC50 22±n/a nM
Citation Sloman, DLNoucti, NAltman, MDChen, DMislak, ACSzewczak, AHayashi, MWarren, LDellovade, TWu, ZMarcus, JWalker, DSu, HPEdavettal, SCMunshi, SHutton, MNuthall, HStanton, MG Optimization of microtubule affinity regulating kinase (MARK) inhibitors with improved physical properties. Bioorg Med Chem Lett26:4362-6 (2016) 
 
Misshapen-like kinase 1
Name:Misshapen-like kinase 1
Type:PROTEIN
Mol. Mass.:149838.92
Organism:Homo sapiens (Human)
Description:ChEMBL_793919
Residue:1332
BDBM50536678
NameBDBM50536678
Synonyms:CHEMBL4550702
TypeSmall organic molecule
Emp. Form.C17H13F3N6OS
Mol. Mass.406.385
SMILESCn1cc(cn1)-c1cnc2c(cnn2c1)-c1csc(c1)C(=O)NCC(F)(F)F