Reaction Details
TargetCholecystokinin receptor type A
LigandBDBM50092396
Substrate/Competitorn/a
Meas. Tech.ChEMBL_49727 (CHEMBL661969)
Ki 2.6±n/a nM
Citation Bellier, BMillion, MEDaNascimento, SMeudal, HKellou, SMaigret, BGarbay, C Replacement of glycine with dicarbonyl and related moieties in analogues of the C-terminal pentapeptide of cholecystokinin: CCK(2) agonists displaying a novel binding mode. J Med Chem43:3614-23 (2000) Cholecystokinin receptor type A
Name:Cholecystokinin receptor type A
Type:n/a
Mol. Mass.:48229.77
Organism:Cavia porcellus
Description:n/a
Residue:430
BDBM50092396
NameBDBM50092396
Synonyms:3-(2-{[2-Amino-3-(1H-indol-3-yl)-propionyl]-methyl-amino}-hexanoylamino)-N-(1-carbamoyl-2-phenyl-ethyl)-succinamic acid | CHEMBL333762
TypeSmall organic molecule
Emp. Form.C31H40N6O6
Mol. Mass.592.6859
SMILESCCCC[C@H](N(C)C(=O)[C@@H](N)Cc1c[nH]c2ccccc12)C(=O)N[C@@H](CC(O)=O)C(=O)N[C@@H](Cc1ccccc1)C(N)=O