Reaction Details
TargetGastrin/cholecystokinin type B receptor
LigandBDBM50092398
Substrate/Competitorn/a
Meas. Tech.ChEMBL_48099 (CHEMBL663086)
Ki 0.8±n/a nM
Citation Bellier, BMillion, MEDaNascimento, SMeudal, HKellou, SMaigret, BGarbay, C Replacement of glycine with dicarbonyl and related moieties in analogues of the C-terminal pentapeptide of cholecystokinin: CCK(2) agonists displaying a novel binding mode. J Med Chem43:3614-23 (2000) Gastrin/cholecystokinin type B receptor
Name:Gastrin/cholecystokinin type B receptor
Type:G Protein-Coupled Receptor (GPCR)
Mol. Mass.:48445.79
Organism:Homo sapiens (Human)
Description:Stable expression of human CCK-2 receptors in HEK 293 cells.
Residue:447
BDBM50092398
NameBDBM50092398
Synonyms:(S)-3-((S)-2-{[(S)-2-tert-Butoxycarbonylamino-3-(1H-indol-3-yl)-propionyl]-methyl-amino}-hexanoylamino)-N-((S)-1-carbamoyl-2-phenyl-ethyl)-succinamic acid CHEMBL333477
TypeSmall organic molecule
Emp. Form.C36H48N6O8
Mol. Mass.692.8017
SMILESCCCC[C@H](N(C)C(=O)[C@H](Cc1c[nH]c2ccccc12)NC(=O)OC(C)(C)C)C(=O)N[C@@H](CC(O)=O)C(=O)N[C@@H](Cc1ccccc1)C(N)=O