Reaction Details
TargetGastrin/cholecystokinin type B receptor
LigandBDBM50092408
Substrate/Competitorn/a
Meas. Tech.ChEMBL_48099 (CHEMBL663086)
Ki 0.54±n/a nM
Citation Bellier, BMillion, MEDaNascimento, SMeudal, HKellou, SMaigret, BGarbay, C Replacement of glycine with dicarbonyl and related moieties in analogues of the C-terminal pentapeptide of cholecystokinin: CCK(2) agonists displaying a novel binding mode. J Med Chem43:3614-23 (2000) Gastrin/cholecystokinin type B receptor
Name:Gastrin/cholecystokinin type B receptor
Type:G Protein-Coupled Receptor (GPCR)
Mol. Mass.:48445.79
Organism:Homo sapiens (Human)
Description:Stable expression of human CCK-2 receptors in HEK 293 cells.
Residue:447
BDBM50092408
NameBDBM50092408
Synonyms:CHEMBL120150 | N-(1-Carbamoyl-2-phenyl-ethyl)-3-(2-{[3-(1H-indol-3-yl)-2-(2-sulfo-acetylamino)-propionyl]-methyl-amino}-hexanoylamino)-succinamic acid
TypeSmall organic molecule
Emp. Form.C33H42N6O10S
Mol. Mass.714.786
SMILESCCCC[C@H](N(C)C(=O)[C@H](Cc1c[nH]c2ccccc12)NC(=O)CS(O)(=O)=O)C(=O)N[C@@H](CC(O)=O)C(=O)N[C@@H](Cc1ccccc1)C(N)=O