Reaction Details
TargetCholecystokinin receptor type A
LigandBDBM50092395
Substrate/Competitorn/a
Meas. Tech.ChEMBL_49727 (CHEMBL661969)
Ki 2900±n/a nM
Citation Bellier, BMillion, MEDaNascimento, SMeudal, HKellou, SMaigret, BGarbay, C Replacement of glycine with dicarbonyl and related moieties in analogues of the C-terminal pentapeptide of cholecystokinin: CCK(2) agonists displaying a novel binding mode. J Med Chem43:3614-23 (2000) Cholecystokinin receptor type A
Name:Cholecystokinin receptor type A
Type:n/a
Mol. Mass.:48229.77
Organism:Cavia porcellus
Description:n/a
Residue:430
BDBM50092395
NameBDBM50092395
Synonyms:3-{2-[2-{[9-tert-Butoxycarbonylamino-3-butyl-2,5,8,11-tetraoxo-6-(4-sulfooxy-benzyl)-1,4,7,12tetraaza-cycloheptadecane-17-carbonyl]-amino}-3-(1H-indol-3-yl)-propionylamino]-hexanoylamino}-N-(1-carbamoyl-2-phenyl-ethyl)-succinamic acid | CHEMBL408389
TypeSmall organic molecule
Emp. Form.C60H81N11O17S
Mol. Mass.1260.414
SMILESCCCC[C@H](NC(=O)[C@H](Cc1c[nH]c2ccccc12)NC(=O)[C@H]1CCCCNC(=O)C[C@H](NC(=O)OC(C)(C)C)C(=O)N[C@H](Cc2ccc(OS(O)(=O)=O)cc2)C(=O)N[C@@H](CCCC)C(=O)N1)C(=O)N[C@@H](CC(O)=O)C(=O)N[C@@H](Cc1ccccc1)C(N)=O