Reaction Details
TargetGastrin/cholecystokinin type B receptor
LigandBDBM50092396
Substrate/Competitorn/a
Meas. Tech.ChEMBL_48099 (CHEMBL663086)
Ki>3000±n/a nM
Citation Bellier, BMillion, MEDaNascimento, SMeudal, HKellou, SMaigret, BGarbay, C Replacement of glycine with dicarbonyl and related moieties in analogues of the C-terminal pentapeptide of cholecystokinin: CCK(2) agonists displaying a novel binding mode. J Med Chem43:3614-23 (2000) Gastrin/cholecystokinin type B receptor
Name:Gastrin/cholecystokinin type B receptor
Type:G Protein-Coupled Receptor (GPCR)
Mol. Mass.:48445.79
Organism:Homo sapiens (Human)
Description:Stable expression of human CCK-2 receptors in HEK 293 cells.
Residue:447
BDBM50092396
NameBDBM50092396
Synonyms:3-(2-{[2-Amino-3-(1H-indol-3-yl)-propionyl]-methyl-amino}-hexanoylamino)-N-(1-carbamoyl-2-phenyl-ethyl)-succinamic acid | CHEMBL333762
TypeSmall organic molecule
Emp. Form.C31H40N6O6
Mol. Mass.592.6859
SMILESCCCC[C@H](N(C)C(=O)[C@@H](N)Cc1c[nH]c2ccccc12)C(=O)N[C@@H](CC(O)=O)C(=O)N[C@@H](Cc1ccccc1)C(N)=O