Reaction Details
TargetCholecystokinin receptor type A
LigandBDBM50092398
Substrate/Competitorn/a
Meas. Tech.ChEMBL_49727 (CHEMBL661969)
Ki>0.7±n/a nM
Citation Bellier, BMillion, MEDaNascimento, SMeudal, HKellou, SMaigret, BGarbay, C Replacement of glycine with dicarbonyl and related moieties in analogues of the C-terminal pentapeptide of cholecystokinin: CCK(2) agonists displaying a novel binding mode. J Med Chem43:3614-23 (2000) Cholecystokinin receptor type A
Name:Cholecystokinin receptor type A
Type:n/a
Mol. Mass.:48229.77
Organism:Cavia porcellus
Description:n/a
Residue:430
BDBM50092398
NameBDBM50092398
Synonyms:(S)-3-((S)-2-{[(S)-2-tert-Butoxycarbonylamino-3-(1H-indol-3-yl)-propionyl]-methyl-amino}-hexanoylamino)-N-((S)-1-carbamoyl-2-phenyl-ethyl)-succinamic acid CHEMBL333477
TypeSmall organic molecule
Emp. Form.C36H48N6O8
Mol. Mass.692.8017
SMILESCCCC[C@H](N(C)C(=O)[C@H](Cc1c[nH]c2ccccc12)NC(=O)OC(C)(C)C)C(=O)N[C@@H](CC(O)=O)C(=O)N[C@@H](Cc1ccccc1)C(N)=O