Reaction Details
TargetcAMP-specific 3',5'-cyclic phosphodiesterase 4A
LigandBDBM50092627
Substrate/Competitorn/a
Meas. Tech.ChEMBL_155660 (CHEMBL763044)
IC50 3.3±n/a nM
Citation Macdonald, DPerrier, HLiu, SLaliberté, FRasori, RRobichaud, AMasson, PHuang, Z Hunting the emesis and efficacy targets of PDE4 inhibitors: identification of the photoaffinity probe 8-(3-azidophenyl)-6- [(4-iodo-1H-1-imidazolyl)methyl]quinoline (APIIMQ). J Med Chem43:3820-3 (2000) cAMP-specific 3',5'-cyclic phosphodiesterase 4A
Name:cAMP-specific 3',5'-cyclic phosphodiesterase 4A
Type:Enzyme
Mol. Mass.:98113.27
Organism:Homo sapiens (Human)
Description:P27815
Residue:886
BDBM50092627
NameBDBM50092627
Synonyms:8-(5-Azido-2-iodo-phenyl)-6-pyridin-4-ylmethyl-quinoline | CHEMBL127201
TypeSmall organic molecule
Emp. Form.C21H14IN5
Mol. Mass.463.2738
SMILESIc1ccc(cc1-c1cc(Cc2ccncc2)cc2cccnc12)N=[N+]=[N-]