Reaction Details
TargetcAMP-specific 3',5'-cyclic phosphodiesterase 4A
LigandBDBM50092629
Substrate/Competitorn/a
Meas. Tech.ChEMBL_155660 (CHEMBL763044)
IC50 15±n/a nM
Citation Macdonald, DPerrier, HLiu, SLaliberté, FRasori, RRobichaud, AMasson, PHuang, Z Hunting the emesis and efficacy targets of PDE4 inhibitors: identification of the photoaffinity probe 8-(3-azidophenyl)-6- [(4-iodo-1H-1-imidazolyl)methyl]quinoline (APIIMQ). J Med Chem43:3820-3 (2000) cAMP-specific 3',5'-cyclic phosphodiesterase 4A
Name:cAMP-specific 3',5'-cyclic phosphodiesterase 4A
Type:Enzyme
Mol. Mass.:98113.27
Organism:Homo sapiens (Human)
Description:P27815
Residue:886
BDBM50092629
NameBDBM50092629
Synonyms:CHEMBL123576 | [8-(3-Iodo-phenyl)-quinolin-6-yl]-phenyl-methanone
TypeSmall organic molecule
Emp. Form.C22H14INO
Mol. Mass.435.2571
SMILESIc1cccc(c1)-c1cc(cc2cccnc12)C(=O)c1ccccc1