Reaction Details
TargetcAMP-specific 3',5'-cyclic phosphodiesterase 4A
LigandBDBM50064858
Substrate/Competitorn/a
Meas. Tech.ChEMBL_155661 (CHEMBL763045)
Ki 4±n/a nM
Citation Macdonald, DPerrier, HLiu, SLaliberté, FRasori, RRobichaud, AMasson, PHuang, Z Hunting the emesis and efficacy targets of PDE4 inhibitors: identification of the photoaffinity probe 8-(3-azidophenyl)-6- [(4-iodo-1H-1-imidazolyl)methyl]quinoline (APIIMQ). J Med Chem43:3820-3 (2000) cAMP-specific 3',5'-cyclic phosphodiesterase 4A
Name:cAMP-specific 3',5'-cyclic phosphodiesterase 4A
Type:Enzyme
Mol. Mass.:98113.27
Organism:Homo sapiens (Human)
Description:P27815
Residue:886
BDBM50064858
NameBDBM50064858
Synonyms:(R)-4-(2-(3-(cyclopentyloxy)-4-methoxyphenyl)-2-phenylethyl)pyridine 4-[2-(3-Cyclopentyloxy-4-methoxy-phenyl)-2-phenyl-ethyl]-pyridine | CHEMBL32442
TypeSmall organic molecule
Emp. Form.C25H27NO2
Mol. Mass.373.4874
SMILESCOc1ccc(cc1OC1CCCC1)[C@H](Cc1ccncc1)c1ccccc1