Reaction Details
TargetDihydroorotate dehydrogenase (quinone), mitochondrial
LigandBDBM24400
Substrate/Competitorn/a
Meas. Tech.ChEMBL_1935396 (CHEMBL4481155)
IC50>200000±n/a nM
Citation Oukoloff, KLucero, BFrancisco, KRBrunden, KRBallatore, C 1,2,4-Triazolo[1,5-a]pyrimidines in drug design. Eur J Med Chem165:332-346 (2019) 
 
Dihydroorotate dehydrogenase (quinone), mitochondrial
Name:Dihydroorotate dehydrogenase (quinone), mitochondrial
Type:Enzyme
Mol. Mass.:42881.33
Organism:Homo sapiens (Human)
Description:Q02127
Residue:395
BDBM24400
NameBDBM24400
Synonyms:5-methyl-N-(naphthalen-2-yl)-[1,2,4]triazolo[1,5-a]pyrimidin-7-amine Triazolopyrimidine-Based Compound, 7
TypeSmall organic molecule
Emp. Form.C16H13N5
Mol. Mass.275.3079
SMILESCc1cc(Nc2ccc3ccccc3c2)n2ncnc2n1