Reaction Details
TargetTranscription factor Jun
LigandBDBM50092882
Substrate/Competitorn/a
Meas. Tech.ChEMBL_28876 (CHEMBL645946)
IC50 200±n/a nM
Citation Palanki, MSErdman, PEGayo-Fung, LMShevlin, GISullivan, RWGoldman, MERansone, LJBennett, BLManning, AMSuto, MJ Inhibitors of NF-kappaB and AP-1 gene expression: SAR studies on the pyrimidine portion of 2-chloro-4-trifluoromethylpyrimidine-5-[N-(3', 5'-bis(trifluoromethyl)phenyl)carboxamide]. J Med Chem43:3995-4004 (2000) Transcription factor Jun
Name:Transcription factor Jun
Type:n/a
Mol. Mass.:35683.24
Organism:Homo sapiens (Human)
Description:P05412
Residue:331
BDBM50092882
NameBDBM50092882
Synonyms:2,4-Dichloro-pyrimidine-5-carboxylic acid (3,5-bis-trifluoromethyl-phenyl)-amide | CHEMBL340779
TypeSmall organic molecule
Emp. Form.C13H5Cl2F6N3O
Mol. Mass.404.095
SMILESFC(F)(F)c1cc(NC(=O)c2cnc(Cl)nc2Cl)cc(c1)C(F)(F)F