Reaction Details
TargetTranscription factor Jun
LigandBDBM50092888
Substrate/Competitorn/a
Meas. Tech.ChEMBL_28876 (CHEMBL645946)
IC50>10000±n/a nM
Citation Palanki, MSErdman, PEGayo-Fung, LMShevlin, GISullivan, RWGoldman, MERansone, LJBennett, BLManning, AMSuto, MJ Inhibitors of NF-kappaB and AP-1 gene expression: SAR studies on the pyrimidine portion of 2-chloro-4-trifluoromethylpyrimidine-5-[N-(3', 5'-bis(trifluoromethyl)phenyl)carboxamide]. J Med Chem43:3995-4004 (2000) Transcription factor Jun
Name:Transcription factor Jun
Type:n/a
Mol. Mass.:35683.24
Organism:Homo sapiens (Human)
Description:P05412
Residue:331
BDBM50092888
NameBDBM50092888
Synonyms:4-Chloro-2-trifluoromethyl-pyrimidine-5-carboxylic acid (3,5-bis-trifluoromethyl-phenyl)-amide | CHEMBL128426
TypeSmall organic molecule
Emp. Form.C14H5ClF9N3O
Mol. Mass.437.648
SMILESFC(F)(F)c1cc(NC(=O)c2cnc(nc2Cl)C(F)(F)F)cc(c1)C(F)(F)F