Reaction Details
TargetTranscription factor Jun
LigandBDBM50092889
Substrate/Competitorn/a
Meas. Tech.ChEMBL_28876 (CHEMBL645946)
IC50 4000±n/a nM
Citation Palanki, MSErdman, PEGayo-Fung, LMShevlin, GISullivan, RWGoldman, MERansone, LJBennett, BLManning, AMSuto, MJ Inhibitors of NF-kappaB and AP-1 gene expression: SAR studies on the pyrimidine portion of 2-chloro-4-trifluoromethylpyrimidine-5-[N-(3', 5'-bis(trifluoromethyl)phenyl)carboxamide]. J Med Chem43:3995-4004 (2000) Transcription factor Jun
Name:Transcription factor Jun
Type:n/a
Mol. Mass.:35683.24
Organism:Homo sapiens (Human)
Description:P05412
Residue:331
BDBM50092889
NameBDBM50092889
Synonyms:5-Chloro-pyrazine-2-carboxylic acid (3,5-bis-trifluoromethyl-phenyl)-amide | CHEMBL340410
TypeSmall organic molecule
Emp. Form.C13H6ClF6N3O
Mol. Mass.369.65
SMILESFC(F)(F)c1cc(NC(=O)c2cnc(Cl)cn2)cc(c1)C(F)(F)F