Reaction Details
TargetMuscarinic acetylcholine receptor M2
LigandBDBM50092963
Substrate/Competitorn/a
Meas. Tech.ChEBML_139765
Ki 0.450000±n/a nM
Citation Wang, YChackalamannil, SHu, ZClader, JWGreenlee, WBillard, WBinch, HCrosby, GRuperto, VDuffy, RAMcQuade, RLachowicz, JE Design and synthesis of piperidinyl piperidine analogues as potent and selective M2 muscarinic receptor antagonists. Bioorg Med Chem Lett10:2247-50 (2001) Muscarinic acetylcholine receptor M2
Name:Muscarinic acetylcholine receptor M2
Type:GPCR
Mol. Mass.:51730.61
Organism:Homo sapiens (Human)
Description:P08172
Residue:466
BDBM50092963
NameBDBM50092963
Synonyms:4-{1-[4-(4-Methoxy-benzenesulfonyl)-phenyl]-vinyl}-[1,4']bipiperidinyl-1'-carboxylic acid benzyl ester benzyl 4-(4-(1-(4-(4-methoxyphenylsulfonyl)phenyl)vinyl)piperidin-1-yl)piperidine-1-carboxylate
TypeSmall organic molecule
Emp. Form.C33H38N2O5S
Mol. Mass.574.73
SMILESCOc1ccc(cc1)S(=O)(=O)c1ccc(cc1)C(=C)C1CCN(CC1)C1CCN(CC1)C(=O)OCc1ccccc1