Reaction Details
TargetMuscarinic acetylcholine receptor M2
LigandBDBM50092969
Substrate/Competitorn/a
Meas. Tech.ChEBML_139765
Ki 0.260000±n/a nM
Citation Wang, YChackalamannil, SHu, ZClader, JWGreenlee, WBillard, WBinch, HCrosby, GRuperto, VDuffy, RAMcQuade, RLachowicz, JE Design and synthesis of piperidinyl piperidine analogues as potent and selective M2 muscarinic receptor antagonists. Bioorg Med Chem Lett10:2247-50 (2001) Muscarinic acetylcholine receptor M2
Name:Muscarinic acetylcholine receptor M2
Type:GPCR
Mol. Mass.:51730.61
Organism:Homo sapiens (Human)
Description:P08172
Residue:466
BDBM50092969
NameBDBM50092969
Synonyms:CHEMBL74117 cyclopropyl(4-(4-(1-(4-(4-methoxyphenylsulfonyl)phenyl)vinyl)piperidin-1-yl)piperidin-1-yl)methanone
TypeSmall organic molecule
Emp. Form.C29H36N2O4S
Mol. Mass.508.672
SMILESCOc1ccc(cc1)S(=O)(=O)c1ccc(cc1)C(=C)C1CCN(CC1)C1CCN(CC1)C(=O)C1CC1