Reaction Details
TargetMuscarinic acetylcholine receptor M2
LigandBDBM50092970
Substrate/Competitorn/a
Meas. Tech.ChEBML_139765
Ki 0.460000±n/a nM
Citation Wang, YChackalamannil, SHu, ZClader, JWGreenlee, WBillard, WBinch, HCrosby, GRuperto, VDuffy, RAMcQuade, RLachowicz, JE Design and synthesis of piperidinyl piperidine analogues as potent and selective M2 muscarinic receptor antagonists. Bioorg Med Chem Lett10:2247-50 (2001) Muscarinic acetylcholine receptor M2
Name:Muscarinic acetylcholine receptor M2
Type:GPCR
Mol. Mass.:51730.61
Organism:Homo sapiens (Human)
Description:P08172
Residue:466
BDBM50092970
NameBDBM50092970
Synonyms:1'-Ethanesulfonyl-4-{1-[4-(4-methoxy-benzenesulfonyl)-phenyl]-vinyl}-[1,4']bipiperidinyl CHEMBL73245
TypeSmall organic molecule
Emp. Form.C27H36N2O5S2
Mol. Mass.532.715
SMILESCCS(=O)(=O)N1CCC(CC1)N1CCC(CC1)C(=C)c1ccc(cc1)S(=O)(=O)c1ccc(OC)cc1