Reaction Details
TargetMuscarinic acetylcholine receptor M2
LigandBDBM50092989
Substrate/Competitorn/a
Meas. Tech.ChEBML_139763
Ki 0.200000±n/a nM
Citation Kozlowski, JALowe, DBGuzik, HSZhou, GRuperto, VBDuffy, RAMcQuade, RCrosby, GTaylor, LABillard, WBinch, HLachowicz, JE Diphenyl sulfoxides as selective antagonists of the muscarinic M2 receptor. Bioorg Med Chem Lett10:2255-7 (2001) Muscarinic acetylcholine receptor M2
Name:Muscarinic acetylcholine receptor M2
Type:GPCR
Mol. Mass.:51730.61
Organism:Homo sapiens (Human)
Description:P08172
Residue:466
BDBM50092989
NameBDBM50092989
Synonyms:1-[1-(4-Benzenesulfonyl-phenyl)-ethyl]-4-cyclohexyl-piperazine | CHEMBL312085
TypeSmall organic molecule
Emp. Form.C24H32N2O2S
Mol. Mass.412.588
SMILESCC(N1CCN(CC1)C1CCCCC1)c1ccc(cc1)S(=O)(=O)c1ccccc1